Reaction Details
TargetSerine/threonine-protein kinase B-raf
LigandBDBM50006650
Substrate/Competitorn/a
Meas. Tech.ChEMBL_1335767 (CHEMBL3239797)
IC50 0.030000±n/a nM
Citation El-Nassan, HB Recent progress in the identification of BRAF inhibitors as anti-cancer agents. Eur J Med Chem72:170-205 (2014) 
 
Serine/threonine-protein kinase B-raf
Name:Serine/threonine-protein kinase B-raf
Type:Serine/threonine-protein kinase
Mol. Mass.:84446.00
Organism:Homo sapiens (Human)
Description:P15056
Residue:766
BDBM50006650
NameBDBM50006650
Synonyms:CHEMBL526479
TypeSmall organic molecule
Emp. Form.C22H23N5O
Mol. Mass.373.4509
SMILESO\N=C1/CCc2cc(ccc12)-c1cn(nc1-c1ccncc1)C1CCNCC1