Reaction Details
TargetSerine/threonine-protein kinase B-raf
LigandBDBM50006653
Substrate/Competitorn/a
Meas. Tech.ChEMBL_1335767 (CHEMBL3239797)
IC50 0.220000±n/a nM
Citation El-Nassan, HB Recent progress in the identification of BRAF inhibitors as anti-cancer agents. Eur J Med Chem72:170-205 (2014) 
 
Serine/threonine-protein kinase B-raf
Name:Serine/threonine-protein kinase B-raf
Type:Serine/threonine-protein kinase
Mol. Mass.:84446.00
Organism:Homo sapiens (Human)
Description:P15056
Residue:766
BDBM50006653
NameBDBM50006653
Synonyms:CHEMBL497671
TypeSmall organic molecule
Emp. Form.C22H22N4O2
Mol. Mass.374.4357
SMILESO\N=C1/CCc2cc(ccc12)-c1cn(nc1-c1ccncc1)C1CCOCC1