Reaction Details
TargetPotassium voltage-gated channel subfamily H member 2
LigandBDBM50007600
Substrate/Competitorn/a
Meas. Tech.ChEMBL_1339147 (CHEMBL3243282)
IC50>100000±n/a nM
Citation Piatnitski Chekler, ELUnwalla, RKhan, TATangirala, RSJohnson, MSt Andre, MAnderson, JTKenney, TChiparri, SMcNally, CKilbourne, EThompson, CNagpal, SWeber, GSchelling, SOwens, JMorris, CAPowell, DVerhoest, PRGilbert, AM 1-(2-Hydroxy-2-methyl-3-phenoxypropanoyl)indoline-4-carbonitrile derivatives as potent and tissue selective androgen receptor modulators. J Med Chem57:2462-71 (2014) 
 
Potassium voltage-gated channel subfamily H member 2
Name:Potassium voltage-gated channel subfamily H member 2
Type:Multi-pass membrane protein
Mol. Mass.:126672.65
Organism:Homo sapiens (Human)
Description:Q12809
Residue:1159
BDBM50007600
NameBDBM50007600
Synonyms:CHEMBL3238274
TypeSmall organic molecule
Emp. Form.C19H17FN2O3
Mol. Mass.340.3483
SMILESC[C@](O)(COc1ccc(F)cc1)C(=O)N1CCc2c1cccc2C#N