Reaction Details
TargetAndrogen receptor
LigandBDBM50007598
Substrate/Competitorn/a
Meas. Tech.ChEMBL_1339116 (CHEMBL3243251)
IC50 37±n/a nM
Citation Piatnitski Chekler, ELUnwalla, RKhan, TATangirala, RSJohnson, MSt Andre, MAnderson, JTKenney, TChiparri, SMcNally, CKilbourne, EThompson, CNagpal, SWeber, GSchelling, SOwens, JMorris, CAPowell, DVerhoest, PRGilbert, AM 1-(2-Hydroxy-2-methyl-3-phenoxypropanoyl)indoline-4-carbonitrile derivatives as potent and tissue selective androgen receptor modulators. J Med Chem57:2462-71 (2014) 
 
Androgen receptor
Name:Androgen receptor
Type:Receptor
Mol. Mass.:99185.27
Organism:Homo sapiens (Human)
Description:CHO cells were stably transfected with human AR gene.
Residue:920
BDBM50007598
NameBDBM50007598
Synonyms:CHEMBL3233072
TypeSmall organic molecule
Emp. Form.C19H16BrFN2O3
Mol. Mass.419.244
SMILESC[C@](O)(COc1ccc(Br)cc1F)C(=O)N1CCc2c1cccc2C#N