Reaction Details
TargetAndrogen receptor
LigandBDBM50007608
Substrate/Competitorn/a
Meas. Tech.ChEMBL_1339117 (CHEMBL3243252)
EC50 8.6±n/a nM
Citation Piatnitski Chekler, ELUnwalla, RKhan, TATangirala, RSJohnson, MSt Andre, MAnderson, JTKenney, TChiparri, SMcNally, CKilbourne, EThompson, CNagpal, SWeber, GSchelling, SOwens, JMorris, CAPowell, DVerhoest, PRGilbert, AM 1-(2-Hydroxy-2-methyl-3-phenoxypropanoyl)indoline-4-carbonitrile derivatives as potent and tissue selective androgen receptor modulators. J Med Chem57:2462-71 (2014) 
 
Androgen receptor
Name:Androgen receptor
Type:Receptor
Mol. Mass.:99185.27
Organism:Homo sapiens (Human)
Description:CHO cells were stably transfected with human AR gene.
Residue:920
BDBM50007608
NameBDBM50007608
Synonyms:CHEMBL3238282
TypeSmall organic molecule
Emp. Form.C20H20N2O4
Mol. Mass.352.3838
SMILESCOc1ccc(OC[C@](C)(O)C(=O)N2CCc3c2cccc3C#N)cc1