Reaction Details
TargetHeat shock protein HSP 90-alpha
LigandBDBM50007733
Substrate/Competitorn/a
Meas. Tech.ChEMBL_1335350 (CHEMBL3238929)
IC50 68±n/a nM
Citation Baruchello, RSimoni, DMarchetti, PRondanin, RMangiola, SCostantini, CMeli, MGiannini, GVesci, LCarollo, VBrunetti, TBattistuzzi, GTolomeo, MCabri, W 4,5,6,7-Tetrahydro-isoxazolo-[4,5-c]-pyridines as a new class of cytotoxic Hsp90 inhibitors. Eur J Med Chem76:53-60 (2014) 
 
Heat shock protein HSP 90-alpha
Name:Heat shock protein HSP 90-alpha
Type:Molecular Chaperone
Mol. Mass.:84623.45
Organism:Homo sapiens (Human)
Description:P07900
Residue:732
BDBM50007733
NameBDBM50007733
Synonyms:CHEMBL3233753
TypeSmall organic molecule
Emp. Form.C22H27N3O5
Mol. Mass.413.4669
SMILESCC(C)c1cc(C(=O)N2CCc3onc(C(=O)NC4CCCC4)c3C2)c(O)cc1O