Reaction Details
TargetPolyamine deacetylase HDAC10
LigandBDBM50007730
Substrate/Competitorn/a
Meas. Tech.ChEMBL_1335366 (CHEMBL3238945)
IC50 886±n/a nM
Citation Baruchello, RSimoni, DMarchetti, PRondanin, RMangiola, SCostantini, CMeli, MGiannini, GVesci, LCarollo, VBrunetti, TBattistuzzi, GTolomeo, MCabri, W 4,5,6,7-Tetrahydro-isoxazolo-[4,5-c]-pyridines as a new class of cytotoxic Hsp90 inhibitors. Eur J Med Chem76:53-60 (2014) 
 
Polyamine deacetylase HDAC10
Name:Polyamine deacetylase HDAC10
Type:Chromatin regulator; hydrolase; repressor
Mol. Mass.:71431.89
Organism:Homo sapiens (Human)
Description:Q969S8
Residue:669
BDBM50007730
NameBDBM50007730
Synonyms:CHEMBL3233755
TypeSmall organic molecule
Emp. Form.C24H32N4O7
Mol. Mass.488.5335
SMILESCC(C)c1cc(C(=O)N2CCc3onc(C(=O)NCCCCCCC(=O)NO)c3C2)c(O)cc1O