Reaction Details
TargetHistone deacetylase 4
LigandBDBM50007730
Substrate/Competitorn/a
Meas. Tech.ChEMBL_1335361 (CHEMBL3238940)
IC50 75900±n/a nM
Citation Baruchello, RSimoni, DMarchetti, PRondanin, RMangiola, SCostantini, CMeli, MGiannini, GVesci, LCarollo, VBrunetti, TBattistuzzi, GTolomeo, MCabri, W 4,5,6,7-Tetrahydro-isoxazolo-[4,5-c]-pyridines as a new class of cytotoxic Hsp90 inhibitors. Eur J Med Chem76:53-60 (2014) 
 
Histone deacetylase 4
Name:Histone deacetylase 4
Type:Enzyme
Mol. Mass.:119049.39
Organism:Homo sapiens (Human)
Description:P56524
Residue:1084
BDBM50007730
NameBDBM50007730
Synonyms:CHEMBL3233755
TypeSmall organic molecule
Emp. Form.C24H32N4O7
Mol. Mass.488.5335
SMILESCC(C)c1cc(C(=O)N2CCc3onc(C(=O)NCCCCCCC(=O)NO)c3C2)c(O)cc1O