Reaction Details
TargetHeat shock protein HSP 90-alpha
LigandBDBM50007742
Substrate/Competitorn/a
Meas. Tech.ChEMBL_1335350 (CHEMBL3238929)
IC50>100000±n/a nM
Citation Baruchello, RSimoni, DMarchetti, PRondanin, RMangiola, SCostantini, CMeli, MGiannini, GVesci, LCarollo, VBrunetti, TBattistuzzi, GTolomeo, MCabri, W 4,5,6,7-Tetrahydro-isoxazolo-[4,5-c]-pyridines as a new class of cytotoxic Hsp90 inhibitors. Eur J Med Chem76:53-60 (2014) 
 
Heat shock protein HSP 90-alpha
Name:Heat shock protein HSP 90-alpha
Type:Molecular Chaperone
Mol. Mass.:84623.45
Organism:Homo sapiens (Human)
Description:P07900
Residue:732
BDBM50007742
NameBDBM50007742
Synonyms:CHEMBL3233489
TypeSmall organic molecule
Emp. Form.C16H17ClN4O5
Mol. Mass.380.783
SMILESCCNC(=O)c1noc2CCN(Cc12)C(=O)Nc1cc(Cl)c(O)cc1O