Reaction Details
TargetHistone deacetylase 8
LigandBDBM50008222
Substrate/Competitorn/a
Meas. Tech.ChEMBL_1339173 (CHEMBL3243336)
IC50 717±n/a nM
Citation Taddei, MFerrini, SGiannotti, LCorsi, MManetti, FGiannini, GVesci, LMilazzo, FMAlloatti, DGuglielmi, MBCastorina, MCervoni, MLBarbarino, MFoderà, RCarollo, VPisano, CArmaroli, SCabri, W Synthesis and evaluation of new Hsp90 inhibitors based on a 1,4,5-trisubstituted 1,2,3-triazole scaffold. J Med Chem57:2258-74 (2014) 
 
Histone deacetylase 8
Name:Histone deacetylase 8
Type:Enzyme
Mol. Mass.:41749.60
Organism:Homo sapiens (Human)
Description:Q9BY41
Residue:377
BDBM50008222
NameBDBM50008222
Synonyms:CHEMBL3235118
TypeSmall organic molecule
Emp. Form.C30H40N6O6
Mol. Mass.580.6752
SMILESCC(C)c1cc(c(O)cc1O)-n1nnc(C(=O)NCCCCCCC(=O)NO)c1-c1ccc(CN2CCOCC2)cc1