Reaction Details
TargetHeat shock protein HSP 90-alpha
LigandBDBM50008250
Substrate/Competitorn/a
Meas. Tech.ChEMBL_1338401 (CHEMBL3240454)
IC50 27±n/a nM
Citation Taddei, MFerrini, SGiannotti, LCorsi, MManetti, FGiannini, GVesci, LMilazzo, FMAlloatti, DGuglielmi, MBCastorina, MCervoni, MLBarbarino, MFoderà, RCarollo, VPisano, CArmaroli, SCabri, W Synthesis and evaluation of new Hsp90 inhibitors based on a 1,4,5-trisubstituted 1,2,3-triazole scaffold. J Med Chem57:2258-74 (2014) 
 
Heat shock protein HSP 90-alpha
Name:Heat shock protein HSP 90-alpha
Type:Molecular Chaperone
Mol. Mass.:84623.45
Organism:Homo sapiens (Human)
Description:P07900
Residue:732
BDBM50008250
NameBDBM50008250
Synonyms:CHEMBL3234761
TypeSmall organic molecule
Emp. Form.C29H33N5O2
Mol. Mass.483.6046
SMILESCC(C)c1cc(c(O)cc1O)-n1nncc1-c1ccc(CN2CCN(Cc3ccccc3)CC2)cc1