Reaction Details
TargetHeat shock protein HSP 90-alpha
LigandBDBM50008253
Substrate/Competitorn/a
Meas. Tech.ChEMBL_1338401 (CHEMBL3240454)
IC50<5.0±n/a nM
Citation Taddei, MFerrini, SGiannotti, LCorsi, MManetti, FGiannini, GVesci, LMilazzo, FMAlloatti, DGuglielmi, MBCastorina, MCervoni, MLBarbarino, MFoderà, RCarollo, VPisano, CArmaroli, SCabri, W Synthesis and evaluation of new Hsp90 inhibitors based on a 1,4,5-trisubstituted 1,2,3-triazole scaffold. J Med Chem57:2258-74 (2014) 
 
Heat shock protein HSP 90-alpha
Name:Heat shock protein HSP 90-alpha
Type:Molecular Chaperone
Mol. Mass.:84623.45
Organism:Homo sapiens (Human)
Description:P07900
Residue:732
BDBM50008253
NameBDBM50008253
Synonyms:CHEMBL3234764
TypeSmall organic molecule
Emp. Form.C25H31N5O4
Mol. Mass.465.5447
SMILESCCNC(=O)c1nnn(c1-c1ccc(CN2CCOCC2)cc1)-c1cc(C(C)C)c(O)cc1O