Reaction Details
TargetHeat shock protein HSP 90-alpha
LigandBDBM50008263
Substrate/Competitorn/a
Meas. Tech.ChEMBL_1338401 (CHEMBL3240454)
IC50<5.0±n/a nM
Citation Taddei, MFerrini, SGiannotti, LCorsi, MManetti, FGiannini, GVesci, LMilazzo, FMAlloatti, DGuglielmi, MBCastorina, MCervoni, MLBarbarino, MFoderà, RCarollo, VPisano, CArmaroli, SCabri, W Synthesis and evaluation of new Hsp90 inhibitors based on a 1,4,5-trisubstituted 1,2,3-triazole scaffold. J Med Chem57:2258-74 (2014) 
 
Heat shock protein HSP 90-alpha
Name:Heat shock protein HSP 90-alpha
Type:Molecular Chaperone
Mol. Mass.:84623.45
Organism:Homo sapiens (Human)
Description:P07900
Residue:732
BDBM50008263
NameBDBM50008263
Synonyms:CHEMBL3234774
TypeSmall organic molecule
Emp. Form.C25H32N6O3
Mol. Mass.464.56
SMILESCCNC(=O)c1nnn(c1-c1ccc(CN2CCNCC2)cc1)-c1cc(C(C)C)c(O)cc1O