Reaction Details
TargetCarbonic anhydrase 9
LigandBDBM50008346
Substrate/Competitorn/a
Meas. Tech.ChEMBL_1334959 (CHEMBL3239312)
Ki 25±n/a nM
Citation Congiu, COnnis, VBalboni, GSupuran, CT Synthesis and carbonic anhydrase I, II, IX and XII inhibition studies of 4-N,N-disubstituted sulfanilamides incorporating 4,4,4-trifluoro-3-oxo-but-1-enyl, phenacylthiourea and imidazol-2(3H)-one/thione moieties. Bioorg Med Chem Lett24:1776-9 (2014) 
 
Carbonic anhydrase 9
Name:Carbonic anhydrase 9
Type:Enzyme
Mol. Mass.:49669.03
Organism:Homo sapiens (Human)
Description:Catalytic domain of human cloned isozyme was used in the assay
Residue:459
BDBM50008346
NameBDBM50008346
Synonyms:CHEMBL3235174
TypeSmall organic molecule
Emp. Form.C15H12FN3O3S
Mol. Mass.333.337
SMILESNS(=O)(=O)c1ccc(cc1)-n1cc([nH]c1=O)-c1ccc(F)cc1