Reaction Details
TargetCarbonic anhydrase 12
LigandBDBM50008340
Substrate/Competitorn/a
Meas. Tech.ChEMBL_1334960 (CHEMBL3239313)
Ki 24±n/a nM
Citation Congiu, COnnis, VBalboni, GSupuran, CT Synthesis and carbonic anhydrase I, II, IX and XII inhibition studies of 4-N,N-disubstituted sulfanilamides incorporating 4,4,4-trifluoro-3-oxo-but-1-enyl, phenacylthiourea and imidazol-2(3H)-one/thione moieties. Bioorg Med Chem Lett24:1776-9 (2014) 
 
Carbonic anhydrase 12
Name:Carbonic anhydrase 12
Type:Enzyme
Mol. Mass.:39456.00
Organism:Homo sapiens (Human)
Description:Catalytic domain of human cloned isozyme was used in the assay
Residue:354
BDBM50008340
NameBDBM50008340
Synonyms:CHEMBL3235171
TypeSmall organic molecule
Emp. Form.C18H19N3O5S2
Mol. Mass.421.491
SMILESCCOC(=O)NC(=S)N(CC(=O)c1ccccc1)c1ccc(cc1)S(N)(=O)=O