Reaction Details
TargetSodium channel protein type 8 subunit alpha
LigandBDBM50008746
Substrate/Competitorn/a
Meas. Tech.ChEMBL_1336366 (CHEMBL3242074)
IC50>100000±n/a nM
Citation Browne, LLidster, KAl-Izki, SClutterbuck, LPosada, CChan, AWRiddall, DGarthwaite, JBaker, DSelwood, DL Imidazol-1-ylethylindazole voltage-gated sodium channel ligands are neuroprotective during optic neuritis in a mouse model of multiple sclerosis. J Med Chem57:2942-52 (2014) 
 
Sodium channel protein type 8 subunit alpha
Name:Sodium channel protein type 8 subunit alpha
Type:PROTEIN
Mol. Mass.:225271.59
Organism:Homo sapiens (Human)
Description:ChEMBL_1516902
Residue:1980
BDBM50008746
NameBDBM50008746
Synonyms:CHEMBL3236343
TypeSmall organic molecule
Emp. Form.C22H19N7O2
Mol. Mass.413.432
SMILESO=C(NCc1noc(n1)-c1nn(CCn2ccnc2)c2ccccc12)c1ccccc1