Reaction Details
TargetCD44 antigen
LigandBDBM50008913
Substrate/Competitorn/a
Meas. Tech.ChEMBL_1337579 (CHEMBL3242488)
Kd 8500000±n/a nM
Citation Liu, LKFinzel, BC Fragment-based identification of an inducible binding site on cell surface receptor CD44 for the design of protein-carbohydrate interaction inhibitors. J Med Chem57:2714-25 (2014) 
 
CD44 antigen
Name:CD44 antigen
Type:PROTEIN
Mol. Mass.:81511.49
Organism:Homo sapiens (Human)
Description:ChEMBL_108280
Residue:742
BDBM50008913
NameBDBM50008913
Synonyms:CHEMBL3183504
TypeSmall organic molecule
Emp. Form.C7H10N2
Mol. Mass.122.1677
SMILESCc1cccc(N)c1N