Reaction Details
TargetCD44 antigen
LigandBDBM50008911
Substrate/Competitorn/a
Meas. Tech.ChEMBL_1337580 (CHEMBL3242489)
Kd 21700±n/a nM
Citation Liu, LKFinzel, BC Fragment-based identification of an inducible binding site on cell surface receptor CD44 for the design of protein-carbohydrate interaction inhibitors. J Med Chem57:2714-25 (2014) 
 
CD44 antigen
Name:CD44 antigen
Type:PROTEIN
Mol. Mass.:85579.86
Organism:Mus musculus
Description:ChEMBL_108281
Residue:778
BDBM50008911
NameBDBM50008911
Synonyms:CHEMBL3237622
TypeSmall organic molecule
Emp. Form.C70H107N5O56
Mol. Mass.1914.5985
SMILES[H][C@@]1(O[C@H]2[C@H](O)[C@@H](CO)O[C@@]([H])(O[C@H]3[C@H](O)[C@@H](O)[C@]([H])(O[C@H]4[C@H](O)[C@@H](CO)O[C@@]([H])(O[C@H]5[C@H](O)[C@@H](O)[C@]([H])(O[C@H]6[C@H](O)[C@@H](CO)O[C@@]([H])(O[C@H]7[C@H](O)[C@@H](O)[C@]([H])(O[C@H]8[C@H](O)[C@@H](CO)O[C@@]([H])(O[C@H]9[C@H](O)[C@@H](O)[C@H](O)O[C@@H]9C(O)=O)[C@@H]8NC(C)=O)O[C@@H]7C(O)=O)[C@@H]6NC(C)=O)O[C@@H]5C(O)=O)[C@@H]4NC(C)=O)O[C@@H]3C(O)=O)[C@@H]2NC(C)=O)O[C@@H]([C@@H](O[C@]2([H])O[C@H](CO)[C@@H](O)[C@H](O)[C@H]2NC(C)=O)[C@H](O)[C@H]1O)C(O)=O