Reaction Details
Target5-hydroxytryptamine receptor 2A
LigandBDBM50009381
Substrate/Competitorn/a
Meas. Tech.ChEMBL_1335963 (CHEMBL3239084)
Ki 8.2±n/a nM
Citation Wang, SChen, YZhao, SXu, XLiu, XLiu, BFZhang, G Synthesis and biological evaluation of a series of benzoxazole/benzothiazole-containing 2,3-dihydrobenzo[b][1,4]dioxine derivatives as potential antidepressants. Bioorg Med Chem Lett24:1766-70 (2014) 
 
5-hydroxytryptamine receptor 2A
Name:5-hydroxytryptamine receptor 2A
Type:G Protein-Coupled Receptor (GPCR)
Mol. Mass.:52852.05
Organism:Rattus norvegicus (rat)
Description:Rat cortex membranes 5-HT2A receptors.
Residue:471
BDBM50009381
NameBDBM50009381
Synonyms:CHEMBL3233863
TypeSmall organic molecule
Emp. Form.C25H30N2O4
Mol. Mass.422.5167
SMILESCC1Oc2ccccc2OC1COCCCN1CCC(CC1)c1nc2ccccc2o1