Reaction Details
TargetPyridoxal kinase
LigandBDBM50009724
Substrate/Competitorn/a
Meas. Tech.ChEMBL_1346665 (CHEMBL3253500)
Ki 105000±n/a nM
Citation Korytnyk, WAngelino, N Vitamin B6 antagonists obtained by replacing or modifying the 2-methyl group. J Med Chem20:745-9 (1977) Pyridoxal kinase
Name:Pyridoxal kinase
Type:PROTEIN
Mol. Mass.:35099.40
Organism:Homo sapiens (Human)
Description:ChEMBL_103125
Residue:312
BDBM50009724
NameBDBM50009724
Synonyms:CHEMBL3245268
TypeSmall organic molecule
Emp. Form.C9H9NO3
Mol. Mass.179.1727
SMILESOCc1cnc(C#C)c(O)c1CO