Reaction Details
TargetMitotic checkpoint serine/threonine-protein kinase BUB1
LigandBDBM50011189
Substrate/Competitorn/a
Meas. Tech.ChEMBL_1351814 (CHEMBL3271320)
IC50 2000±n/a nM
Citation Brazeau, JFRosse, G Novel cycloalkenepyrazoles as inhibitors of bub1 kinase. ACS Med Chem Lett5:280-1 (2014) 
 
Mitotic checkpoint serine/threonine-protein kinase BUB1
Name:Mitotic checkpoint serine/threonine-protein kinase BUB1
Type:PROTEIN
Mol. Mass.:122372.31
Organism:Homo sapiens (Human)
Description:ChEMBL_1510603
Residue:1085
BDBM50011189
NameBDBM50011189
Synonyms:CHEMBL3260328
TypeSmall organic molecule
Emp. Form.C27H28FN7O4
Mol. Mass.533.5541
SMILESNC(=O)c1cnccc1N(CCO)c1nc(ncc1OCCO)-c1nn(Cc2ccccc2F)c2CCCc12