Reaction Details
TargeteIF-2-alpha kinase GCN2
LigandBDBM50011234
Substrate/Competitorn/a
Meas. Tech.ChEMBL_1351815 (CHEMBL3271321)
IC50<300±n/a nM
Citation Brazeau, JFRosse, G Triazolo[4,5-d]pyrimidine Derivatives as Inhibitors of GCN2. ACS Med Chem Lett5:282-3 (2014) 
 
eIF-2-alpha kinase GCN2
Name:eIF-2-alpha kinase GCN2
Type:PROTEIN
Mol. Mass.:186899.26
Organism:Homo sapiens (Human)
Description:ChEMBL_1495738
Residue:1649
BDBM50011234
NameBDBM50011234
Synonyms:CHEMBL3260330
TypeSmall organic molecule
Emp. Form.C19H18N10O
Mol. Mass.402.4126
SMILESC1CC(CCO1)n1ccc(Nc2ncc3n(nnc3n2)-c2ccc3cn[nH]c3c2)n1