Reaction Details
TargetAdenosine receptor A2a
LigandBDBM50238959
Substrate/Competitorn/a
Meas. Tech.ChEMBL_1352083 (CHEMBL3267348)
Ki 1.4±n/a nM
Citation de Lera Ruiz, MLim, YHZheng, J Adenosine A2A receptor as a drug discovery target. J Med Chem57:3623-50 (2014) 
 
Adenosine receptor A2a
Name:Adenosine receptor A2a
Type:G Protein-Coupled Receptor (GPCR)
Mol. Mass.:44716.46
Organism:Homo sapiens (Human)
Description:P29274
Residue:412
BDBM50238959
NameBDBM50238959
Synonyms:2-isopropyl-4-(thiazol-2-yl)thieno[3,2-d]pyrimidine | CHEMBL407307
TypeSmall organic molecule
Emp. Form.C12H11N3S2
Mol. Mass.261.366
SMILESCC(C)c1nc(-c2nccs2)c2sccc2n1