Reaction Details
TargetAdenosine receptor A2a
LigandBDBM50011297
Substrate/Competitorn/a
Meas. Tech.ChEMBL_1352083 (CHEMBL3267348)
Ki 12±n/a nM
Citation de Lera Ruiz, MLim, YHZheng, J Adenosine A2A receptor as a drug discovery target. J Med Chem57:3623-50 (2014) 
 
Adenosine receptor A2a
Name:Adenosine receptor A2a
Type:G Protein-Coupled Receptor (GPCR)
Mol. Mass.:44716.46
Organism:Homo sapiens (Human)
Description:P29274
Residue:412
BDBM50011297
NameBDBM50011297
Synonyms:CHEMBL3260729 | US9029393, 14
TypeSmall organic molecule
Emp. Form.C21H20FN3O2
Mol. Mass.365.4008
SMILESFc1ccc2ncc(C(=O)c3ccc(cc3)C(=O)N3CCCCCC3)n2c1