Reaction Details
TargetAdenosine receptor A2a
LigandBDBM50394715
Substrate/Competitorn/a
Meas. Tech.ChEMBL_1352083 (CHEMBL3267348)
Ki 1.8±n/a nM
Citation de Lera Ruiz, MLim, YHZheng, J Adenosine A2A receptor as a drug discovery target. J Med Chem57:3623-50 (2014) 
 
Adenosine receptor A2a
Name:Adenosine receptor A2a
Type:G Protein-Coupled Receptor (GPCR)
Mol. Mass.:44716.46
Organism:Homo sapiens (Human)
Description:P29274
Residue:412
BDBM50394715
NameBDBM50394715
Synonyms:CHEMBL2165804
TypeSmall organic molecule
Emp. Form.C18H17FN4O
Mol. Mass.324.3522
SMILESCC(C)n1cc(ccc1=O)-c1ncc(N)nc1-c1ccc(F)cc1