Reaction Details
TargetAdenosine receptor A1
LigandBDBM50242873
Substrate/Competitorn/a
Meas. Tech.ChEMBL_1352084 (CHEMBL3267349)
Ki 358±n/a nM
Citation de Lera Ruiz, MLim, YHZheng, J Adenosine A2A receptor as a drug discovery target. J Med Chem57:3623-50 (2014) 
 
Adenosine receptor A1
Name:Adenosine receptor A1
Type:G Protein-Coupled Receptor (GPCR)
Mol. Mass.:36520.92
Organism:Homo sapiens (Human)
Description:P30542
Residue:326
BDBM50242873
NameBDBM50242873
Synonyms:2-Furan-2-yl-7-[2-(3-methyl-7,8-dihydro-5H-[1,6]naphthyridin-6-yl)-ethyl]-7H-pyrazolo[4,3-e][1,2,4]triazolo[1,5-c]pyrimidin-5-ylamine | CHEMBL513364
TypeSmall organic molecule
Emp. Form.C21H21N9O
Mol. Mass.415.4511
SMILESCc1cnc2CCN(CCn3ncc4c3nc(N)n3nc(nc43)-c3ccco3)Cc2c1