Reaction Details
TargetAdenosine receptor A1
LigandBDBM50394715
Substrate/Competitorn/a
Meas. Tech.ChEMBL_1352084 (CHEMBL3267349)
Ki 9.0±n/a nM
Citation de Lera Ruiz, MLim, YHZheng, J Adenosine A2A receptor as a drug discovery target. J Med Chem57:3623-50 (2014) 
 
Adenosine receptor A1
Name:Adenosine receptor A1
Type:G Protein-Coupled Receptor (GPCR)
Mol. Mass.:36520.92
Organism:Homo sapiens (Human)
Description:P30542
Residue:326
BDBM50394715
NameBDBM50394715
Synonyms:CHEMBL2165804
TypeSmall organic molecule
Emp. Form.C18H17FN4O
Mol. Mass.324.3522
SMILESCC(C)n1cc(ccc1=O)-c1ncc(N)nc1-c1ccc(F)cc1