Reaction Details
TargetAdenosine receptor A3
LigandBDBM50239036
Substrate/Competitorn/a
Meas. Tech.ChEMBL_1352085 (CHEMBL3267350)
Ki 1472±n/a nM
Citation de Lera Ruiz, MLim, YHZheng, J Adenosine A2A receptor as a drug discovery target. J Med Chem57:3623-50 (2014) 
 
Adenosine receptor A3
Name:Adenosine receptor A3
Type:G Protein-Coupled Receptor (GPCR)
Mol. Mass.:36197.32
Organism:Homo sapiens (Human)
Description:P0DMS8
Residue:318
BDBM50239036
NameBDBM50239036
Synonyms:2-amino-N-benzyl-6-(furan-2-yl)-9H-purine-9-carboxamide | CHEMBL261203
TypeSmall organic molecule
Emp. Form.C17H14N6O2
Mol. Mass.334.3321
SMILESNc1nc(-c2ccco2)c2ncn(C(=O)NCc3ccccc3)c2n1