Reaction Details
TargetAdenosine receptor A2b
LigandBDBM50254013
Substrate/Competitorn/a
Meas. Tech.ChEMBL_1352081 (CHEMBL3267346)
Ki 63±n/a nM
Citation de Lera Ruiz, MLim, YHZheng, J Adenosine A2A receptor as a drug discovery target. J Med Chem57:3623-50 (2014) 
 
Adenosine receptor A2b
Name:Adenosine receptor A2b
Type:G Protein-Coupled Receptor (GPCR)
Mol. Mass.:36341.22
Organism:Homo sapiens (Human)
Description:n/a
Residue:332
BDBM50254013
NameBDBM50254013
Synonyms:3-(4-Amino-3-methylbenzyl)-7-(2-furyl)-3H-[1,2,3]triazolo[4,5-d]pyrimidine-5-amine | CHEMBL447664
TypeSmall organic molecule
Emp. Form.C16H15N7O
Mol. Mass.321.3366
SMILESCc1cc(Cn2nnc3c(nc(N)nc23)-c2ccco2)ccc1N