Reaction Details
TargetAdenosine receptor A2a
LigandBDBM50011303
Substrate/Competitorn/a
Meas. Tech.ChEMBL_1352082 (CHEMBL3267347)
Ki 6.6±n/a nM
Citation de Lera Ruiz, MLim, YHZheng, J Adenosine A2A receptor as a drug discovery target. J Med Chem57:3623-50 (2014) 
 
Adenosine receptor A2a
Name:Adenosine receptor A2a
Type:G Protein-Coupled Receptor (GPCR)
Mol. Mass.:44716.46
Organism:Homo sapiens (Human)
Description:P29274
Residue:412
BDBM50011303
NameBDBM50011303
Synonyms:CHEMBL3222061
TypeSmall organic molecule
Emp. Form.C16H16F2N4OS
Mol. Mass.350.386
SMILESNc1nc(nc2sc(CN3CCCC(F)(F)C3)cc12)-c1ccco1