Reaction Details
TargetMelatonin receptor type 1B
LigandBDBM85066
Substrate/Competitorn/a
Meas. Tech.ChEMBL_1352245 (CHEMBL3268963)
Ki 0.250000±n/a nM
Citation Zlotos, DPJockers, RCecon, ERivara, SWitt-Enderby, PA MT1 and MT2 melatonin receptors: ligands, models, oligomers, and therapeutic potential. J Med Chem57:3161-85 (2014) 
 
Melatonin receptor type 1B
Name:Melatonin receptor type 1B
Type:Enzyme
Mol. Mass.:40203.54
Organism:Homo sapiens (Human)
Description:P49286
Residue:362
BDBM85066
NameBDBM85066
Synonyms:Luzindole,5-Methoxy
TypeSmall organic molecule
Emp. Form.C20H22N2O2
Mol. Mass.322.4009
SMILESCOc1ccc2[nH]c(Cc3ccccc3)c(CCNC(C)=O)c2c1