Reaction Details
TargetMelatonin receptor type 1A
LigandBDBM50340325
Substrate/Competitorn/a
Meas. Tech.ChEMBL_1352246 (CHEMBL3268964)
Ki 1.4±n/a nM
Citation Zlotos, DPJockers, RCecon, ERivara, SWitt-Enderby, PA MT1 and MT2 melatonin receptors: ligands, models, oligomers, and therapeutic potential. J Med Chem57:3161-85 (2014) 
 
Melatonin receptor type 1A
Name:Melatonin receptor type 1A
Type:Enzyme
Mol. Mass.:39392.94
Organism:Homo sapiens (Human)
Description:P48039
Residue:350
BDBM50340325
NameBDBM50340325
Synonyms:CHEMBL1760945 | N-(2-(6-Methoxy-1H-pyrrolo[2,3-b]pyridin-1-yl)ethyl)acetamide
TypeSmall organic molecule
Emp. Form.C12H15N3O2
Mol. Mass.233.2664
SMILESCOc1ccc2ccn(CCNC(C)=O)c2n1