Reaction Details
TargetNociceptin receptor
LigandBDBM50011513
Substrate/Competitorn/a
Meas. Tech.ChEMBL_1351168 (CHEMBL3270911)
Ki 3.4±n/a nM
Citation Journigan, VBPolgar, WEKhroyan, TVZaveri, NT Designing bifunctional NOP receptor-mu opioid receptor ligands from NOP-receptor selective scaffolds. Part II. Bioorg Med Chem22:2508-16 (2014) 
 
Nociceptin receptor
Name:Nociceptin receptor
Type:G Protein-Coupled Receptor (GPCR)
Mol. Mass.:40702.87
Organism:Homo sapiens (Human)
Description:P41146
Residue:370
BDBM50011513
NameBDBM50011513
Synonyms:CHEMBL3262543
TypeSmall organic molecule
Emp. Form.C26H30N2O
Mol. Mass.386.5292
SMILES[H][C@]12CCCc3cccc([C@@H](CC1)N1CCC(CC1)N1C(=O)Cc4ccccc14)c23