Reaction Details
TargetMu-type opioid receptor
LigandBDBM50011514
Substrate/Competitorn/a
Meas. Tech.ChEMBL_1351169 (CHEMBL3270912)
Ki 8.2±n/a nM
Citation Journigan, VBPolgar, WEKhroyan, TVZaveri, NT Designing bifunctional NOP receptor-mu opioid receptor ligands from NOP-receptor selective scaffolds. Part II. Bioorg Med Chem22:2508-16 (2014) 
 
Mu-type opioid receptor
Name:Mu-type opioid receptor
Type:G Protein-Coupled Receptor (GPCR)
Mol. Mass.:44789.51
Organism:Homo sapiens (Human)
Description:P35372
Residue:400
BDBM50011514
NameBDBM50011514
Synonyms:CHEMBL3262544
TypeSmall organic molecule
Emp. Form.C28H34N2O
Mol. Mass.414.5824
SMILES[H][C@]12CCCc3cccc([C@H](CC1)N1CCC(CC1)N1C(=O)C(CC)c4ccccc14)c23