Reaction Details
TargetKappa-type opioid receptor
LigandBDBM50011515
Substrate/Competitorn/a
Meas. Tech.ChEMBL_1351170 (CHEMBL3270913)
Ki 184±n/a nM
Citation Journigan, VBPolgar, WEKhroyan, TVZaveri, NT Designing bifunctional NOP receptor-mu opioid receptor ligands from NOP-receptor selective scaffolds. Part II. Bioorg Med Chem22:2508-16 (2014) 
 
Kappa-type opioid receptor
Name:Kappa-type opioid receptor
Type:G Protein-Coupled Receptor (GPCR)
Mol. Mass.:42648.76
Organism:Homo sapiens (Human)
Description:P41145
Residue:380
BDBM50011515
NameBDBM50011515
Synonyms:CHEMBL3262545
TypeSmall organic molecule
Emp. Form.C28H34N2O
Mol. Mass.414.5824
SMILES[H][C@]12CCCc3cccc([C@@H](CC1)N1CCC(CC1)N1C(=O)C(CC)c4ccccc14)c23