Reaction Details
TargetNociceptin receptor
LigandBDBM50011516
Substrate/Competitorn/a
Meas. Tech.ChEMBL_1351171 (CHEMBL3270914)
EC50 50±n/a nM
Citation Journigan, VBPolgar, WEKhroyan, TVZaveri, NT Designing bifunctional NOP receptor-mu opioid receptor ligands from NOP-receptor selective scaffolds. Part II. Bioorg Med Chem22:2508-16 (2014) 
 
Nociceptin receptor
Name:Nociceptin receptor
Type:G Protein-Coupled Receptor (GPCR)
Mol. Mass.:40702.87
Organism:Homo sapiens (Human)
Description:P41146
Residue:370
BDBM50011516
NameBDBM50011516
Synonyms:CHEMBL3262546
TypeSmall organic molecule
Emp. Form.C25H30N2O
Mol. Mass.374.5185
SMILESCCC1C(=O)N(C2CCN(CC2)C2CCCc3ccccc23)c2ccccc12