Reaction Details
TargetMu-type opioid receptor
LigandBDBM50011512
Substrate/Competitorn/a
Meas. Tech.ChEMBL_1351172 (CHEMBL3270915)
EC50 409±n/a nM
Citation Journigan, VBPolgar, WEKhroyan, TVZaveri, NT Designing bifunctional NOP receptor-mu opioid receptor ligands from NOP-receptor selective scaffolds. Part II. Bioorg Med Chem22:2508-16 (2014) 
 
Mu-type opioid receptor
Name:Mu-type opioid receptor
Type:G Protein-Coupled Receptor (GPCR)
Mol. Mass.:44789.51
Organism:Homo sapiens (Human)
Description:P35372
Residue:400
BDBM50011512
NameBDBM50011512
Synonyms:CHEMBL3262542
TypeSmall organic molecule
Emp. Form.C26H30N2O
Mol. Mass.386.5292
SMILES[H][C@]12CCCc3cccc([C@H](CC1)N1CCC(CC1)N1C(=O)Cc4ccccc14)c23