Reaction Details
TargetMu-type opioid receptor
LigandBDBM50011520
Substrate/Competitorn/a
Meas. Tech.ChEMBL_1351172 (CHEMBL3270915)
EC50>10000±n/a nM
Citation Journigan, VBPolgar, WEKhroyan, TVZaveri, NT Designing bifunctional NOP receptor-mu opioid receptor ligands from NOP-receptor selective scaffolds. Part II. Bioorg Med Chem22:2508-16 (2014) 
 
Mu-type opioid receptor
Name:Mu-type opioid receptor
Type:G Protein-Coupled Receptor (GPCR)
Mol. Mass.:44789.51
Organism:Homo sapiens (Human)
Description:P35372
Residue:400
BDBM50011520
NameBDBM50011520
Synonyms:CHEMBL3262550
TypeSmall organic molecule
Emp. Form.C31H36N2O
Mol. Mass.452.6303
SMILESCCC1C(=O)N(C2CCN(CC2)C(C)CC(c2ccccc2)c2ccccc2)c2ccccc12