Reaction Details
TargetKappa-type opioid receptor
LigandBDBM50011517
Substrate/Competitorn/a
Meas. Tech.ChEMBL_1351174 (CHEMBL3270917)
EC50 153±n/a nM
Citation Journigan, VBPolgar, WEKhroyan, TVZaveri, NT Designing bifunctional NOP receptor-mu opioid receptor ligands from NOP-receptor selective scaffolds. Part II. Bioorg Med Chem22:2508-16 (2014) 
 
Kappa-type opioid receptor
Name:Kappa-type opioid receptor
Type:G Protein-Coupled Receptor (GPCR)
Mol. Mass.:42648.76
Organism:Homo sapiens (Human)
Description:P41145
Residue:380
BDBM50011517
NameBDBM50011517
Synonyms:CHEMBL3262547
TypeSmall organic molecule
Emp. Form.C25H30N2O
Mol. Mass.374.5185
SMILESCCC1C(=O)N(C2CCN(CC2)C2CCc3ccccc3C2)c2ccccc12