Reaction Details
TargetFatty-acid amide hydrolase 1 [30-579]
LigandBDBM50012171
Substrate/Competitorn/a
Meas. Tech.ChEMBL_1352947 (CHEMBL3269814)
Ki 27±n/a nM
Citation Duncan, KKOtrubova, KBoger, DL a-Ketoheterocycle inhibitors of fatty acid amide hydrolase: exploration of conformational constraints in the acyl side chain. Bioorg Med Chem22:2763-70 (2014) 
 
Fatty-acid amide hydrolase 1 [30-579]
Name:Fatty-acid amide hydrolase 1 [30-579]
Type:Single-pass membrane protein; homodimer
Mol. Mass.:60474.00
Organism:Rattus norvegicus (rat)
Description:P97612 (aa 30-579)
Residue:550
BDBM50012171
NameBDBM50012171
Synonyms:CHEMBL3264474
TypeSmall organic molecule
Emp. Form.C24H18N2O4
Mol. Mass.398.4107
SMILESO=C([C@@H]1COc2cc(Oc3ccccc3)ccc2C1)c1ncc(o1)-c1ccccn1