Reaction Details
TargetSigma non-opioid intracellular receptor 1
LigandBDBM50012192
Substrate/Competitorn/a
Meas. Tech.ChEMBL_1353757 (CHEMBL3266322)
Ki 258±n/a nM
Citation Abate, CNiso, MMarottoli, RRiganti, CGhigo, DFerorelli, SOssato, GPerrone, RLacivita, ELamb, DCBerardi, F Novel derivatives of 1-cyclohexyl-4-[3-(5-methoxy-1,2,3,4-tetrahydronaphthalen-1-yl)propyl]piperazine (PB28) with improved fluorescent ands receptors binding properties. J Med Chem57:3314-23 (2014) 
 
Sigma non-opioid intracellular receptor 1
Name:Sigma non-opioid intracellular receptor 1
Type:Protein
Mol. Mass.:25307.17
Organism:Cavia porcellus (Guinea pig)
Description:Q60492
Residue:223
BDBM50012192
NameBDBM50012192
Synonyms:CHEMBL3259960
TypeSmall organic molecule
Emp. Form.C39H58N6O4
Mol. Mass.674.9156
SMILES[O-][N+](=O)c1ccc(NCCCCCCCCCCOc2cccc3C(CCCN4CCN(CC4)C4CCCCC4)CCCc23)c2nonc12