Reaction Details
TargetSigma non-opioid intracellular receptor 1
LigandBDBM50012203
Substrate/Competitorn/a
Meas. Tech.ChEMBL_1353757 (CHEMBL3266322)
Ki 156±n/a nM
Citation Abate, CNiso, MMarottoli, RRiganti, CGhigo, DFerorelli, SOssato, GPerrone, RLacivita, ELamb, DCBerardi, F Novel derivatives of 1-cyclohexyl-4-[3-(5-methoxy-1,2,3,4-tetrahydronaphthalen-1-yl)propyl]piperazine (PB28) with improved fluorescent ands receptors binding properties. J Med Chem57:3314-23 (2014) 
 
Sigma non-opioid intracellular receptor 1
Name:Sigma non-opioid intracellular receptor 1
Type:Protein
Mol. Mass.:25307.17
Organism:Cavia porcellus (Guinea pig)
Description:Q60492
Residue:223
BDBM50012203
NameBDBM50012203
Synonyms:CHEMBL3259961
TypeSmall organic molecule
Emp. Form.C41H54N4O3
Mol. Mass.650.8925
SMILESNc1ccc2C(=O)N(CCCCCCOc3cccc4C(CCCN5CCN(CC5)C5CCCCC5)CCCc34)C(=O)c3cccc1c23