Reaction Details
TargetSigma non-opioid intracellular receptor 1
LigandBDBM50012205
Substrate/Competitorn/a
Meas. Tech.ChEMBL_1353757 (CHEMBL3266322)
Ki 235±n/a nM
Citation Abate, CNiso, MMarottoli, RRiganti, CGhigo, DFerorelli, SOssato, GPerrone, RLacivita, ELamb, DCBerardi, F Novel derivatives of 1-cyclohexyl-4-[3-(5-methoxy-1,2,3,4-tetrahydronaphthalen-1-yl)propyl]piperazine (PB28) with improved fluorescent ands receptors binding properties. J Med Chem57:3314-23 (2014) 
 
Sigma non-opioid intracellular receptor 1
Name:Sigma non-opioid intracellular receptor 1
Type:Protein
Mol. Mass.:25307.17
Organism:Cavia porcellus (Guinea pig)
Description:Q60492
Residue:223
BDBM50012205
NameBDBM50012205
Synonyms:CHEMBL3259963
TypeSmall organic molecule
Emp. Form.C60H84BrN5O4
Mol. Mass.1019.244
SMILES[Br-].CCN(CC)c1ccc2cc(\C=C\C3=[N+](CCCCCC(=O)NCCCCCCOc4cccc5C(CCCN6CCN(CC6)C6CCCCC6)CCCc45)c4ccccc4C3(C)C)c(=O)oc2c1