Reaction Details
TargetOrexin/Hypocretin receptor type 1
LigandBDBM50012604
Substrate/Competitorn/a
Meas. Tech.ChEMBL_1351465 (CHEMBL3267681)
Ki 0.800000±n/a nM
Citation Roecker, AJMercer, SPHarrell, CMGarson, SLFox, SVGotter, ALPrueksaritanont, TCabalu, TDCui, DLemaire, WWinrow, CJRenger, JJColeman, PJ Discovery of dual orexin receptor antagonists with rat sleep efficacy enabled by expansion of the acetonitrile-assisted/diphosgene-mediated 2,4-dichloropyrimidine synthesis. Bioorg Med Chem Lett24:2079-85 (2014) 
 
Orexin/Hypocretin receptor type 1
Name:Orexin/Hypocretin receptor type 1
Type:Protein
Mol. Mass.:47554.50
Organism:Homo sapiens (Human)
Description:O43613
Residue:425
BDBM50012604
NameBDBM50012604
Synonyms:CHEMBL3260824
TypeSmall organic molecule
Emp. Form.C23H27N9O
Mol. Mass.445.5202
SMILESC[C@@H]1CCN(CCN1C(=O)c1cc(C)ccc1-n1nccn1)c1ncc2c(C)nn(C)c2n1