Reaction Details
TargetP2Y purinoceptor 4
LigandBDBM50013011
Substrate/Competitorn/a
Meas. Tech.ChEMBL_1351703 (CHEMBL3270103)
EC50 410±n/a nM
Citation Jayasekara, PSBarrett, MOBall, CBBrown, KAHammes, EBalasubramanian, RHarden, TKJacobson, KA 4-Alkyloxyimino derivatives of uridine-5'-triphosphate: distal modification of potent agonists as a strategy for molecular probes of P2Y2, P2Y4, and P2Y6 receptors. J Med Chem57:3874-83 (2014) 
 
P2Y purinoceptor 4
Name:P2Y purinoceptor 4
Type:PROTEIN
Mol. Mass.:40977.17
Organism:Homo sapiens (Human)
Description:ChEMBL_751027
Residue:365
BDBM50013011
NameBDBM50013011
Synonyms:CHEMBL3261373
TypeSmall organic molecule
Emp. Form.C14H22N3O15P3
Mol. Mass.565.2569
SMILESO[C@@H]1[C@@H](COP(O)(=O)OP(O)(=O)OP(O)(O)=O)O[C@H]([C@@H]1O)n1cc\c(=N\OCCCC#C)[nH]c1=O