Reaction Details
TargetP2Y purinoceptor 4
LigandBDBM50013030
Substrate/Competitorn/a
Meas. Tech.ChEMBL_1351716 (CHEMBL3270116)
EC50 93±n/a nM
Citation Jayasekara, PSBarrett, MOBall, CBBrown, KAHammes, EBalasubramanian, RHarden, TKJacobson, KA 4-Alkyloxyimino derivatives of uridine-5'-triphosphate: distal modification of potent agonists as a strategy for molecular probes of P2Y2, P2Y4, and P2Y6 receptors. J Med Chem57:3874-83 (2014) 
 
P2Y purinoceptor 4
Name:P2Y purinoceptor 4
Type:PROTEIN
Mol. Mass.:40977.17
Organism:Homo sapiens (Human)
Description:ChEMBL_751027
Residue:365
BDBM50013030
NameBDBM50013030
Synonyms:CHEMBL3261379
TypeSmall organic molecule
Emp. Form.C27H37N5O23P4
Mol. Mass.923.4974
SMILESO[C@@H]1[C@@H](COP(O)(=O)OP(O)(=O)OP(O)(=O)OP(O)(=O)OC[C@H]2O[C@H]([C@H](O)[C@@H]2O)n2cc\c(=N\OCCCc3ccccc3)[nH]c2=O)O[C@H]([C@@H]1O)n1ccc(=O)[nH]c1=O