Reaction Details
TargetCarbonic anhydrase 1
LigandBDBM10880
Substrate/Competitorn/a
Meas. Tech.ChEMBL_1351732 (CHEMBL3270521)
Ki 250±n/a nM
Citation Mojzych, MBielawska, ABielawski, KCeruso, MSupuran, CT Pyrazolo[4,3-e][1,2,4]triazine sulfonamides as carbonic anhydrase inhibitors with antitumor activity. Bioorg Med Chem22:2643-7 (2014) 
 
Carbonic anhydrase 1
Name:Carbonic anhydrase 1
Type:Enzyme
Mol. Mass.:28873.37
Organism:Homo sapiens (Human)
Description:P00915
Residue:261
BDBM10880
NameBDBM10880
Synonyms:AZA AZM acetazolamide Acetazolamide Acetazolamide (AZA) Acetazolamide, 5 Acetazolamide, AZA CHEMBL20 Sulfonamide, 1 US11278534, Example acetazolamide sulfonamide 1
TypeSmall organic molecule
Emp. Form.C4H6N4O3S2
Mol. Mass.222.245
SMILESCC(=O)Nc1nnc(s1)S(N)(=O)=O