Reaction Details
TargetCarbonic anhydrase 2
LigandBDBM50004346
Substrate/Competitorn/a
Meas. Tech.ChEMBL_1351733 (CHEMBL3270522)
Ki 667±n/a nM
Citation Mojzych, MBielawska, ABielawski, KCeruso, MSupuran, CT Pyrazolo[4,3-e][1,2,4]triazine sulfonamides as carbonic anhydrase inhibitors with antitumor activity. Bioorg Med Chem22:2643-7 (2014) 
 
Carbonic anhydrase 2
Name:Carbonic anhydrase 2
Type:Enzyme
Mol. Mass.:29250.71
Organism:Homo sapiens (Human)
Description:P00918
Residue:260
BDBM50004346
NameBDBM50004346
Synonyms:CHEMBL3237848
TypeSmall organic molecule
Emp. Form.C17H22N8O2S
Mol. Mass.402.474
SMILESCN1CCN(CC1)S(=O)(=O)c1ccc(Nc2nnc3n(C)nc(C)c3n2)cc1