Reaction Details
TargetCarbonic anhydrase 12
LigandBDBM50004342
Substrate/Competitorn/a
Meas. Tech.ChEMBL_1351735 (CHEMBL3270524)
Ki 7.9±n/a nM
Citation Mojzych, MBielawska, ABielawski, KCeruso, MSupuran, CT Pyrazolo[4,3-e][1,2,4]triazine sulfonamides as carbonic anhydrase inhibitors with antitumor activity. Bioorg Med Chem22:2643-7 (2014) 
 
Carbonic anhydrase 12
Name:Carbonic anhydrase 12
Type:Enzyme
Mol. Mass.:39456.00
Organism:Homo sapiens (Human)
Description:Catalytic domain of human cloned isozyme was used in the assay
Residue:354
BDBM50004342
NameBDBM50004342
Synonyms:CHEMBL3237855
TypeSmall organic molecule
Emp. Form.C12H13N7O2S
Mol. Mass.319.342
SMILESCc1nn(C)c2nnc(Nc3ccc(cc3)S(N)(=O)=O)nc12