Reaction Details
Target5-hydroxytryptamine receptor 2C
LigandBDBM50013050
Substrate/Competitorn/a
Meas. Tech.ChEMBL_1350021 (CHEMBL3270821)
Ki 0.600000±n/a nM
Citation Eliás, OAgai-Csongor, EDomány, GKeseru, GMGere, AKiss, BHellinger, EVastag, MGyertyán, I Design of novel multiple-acting ligands towards SERT and 5-HT2C receptors. Bioorg Med Chem Lett24:2118-22 (2014) 
 
5-hydroxytryptamine receptor 2C
Name:5-hydroxytryptamine receptor 2C
Type:Enzyme
Mol. Mass.:51935.10
Organism:Rattus norvegicus (Rat)
Description:P08909
Residue:460
BDBM50013050
NameBDBM50013050
Synonyms:CHEMBL3261693
TypeSmall organic molecule
Emp. Form.C25H28ClN3O2
Mol. Mass.437.962
SMILESCN(C)CCC(Oc1ccc(NC(=O)Nc2ccc(C)c(Cl)c2)cc1)c1ccccc1